Target
Toll-like receptor 7
Ligand
BDBM428090
Substrate
Meas. Tech.
TLR7/8/9 Inhibition Reporter Assays
IC50
0.180±n/a nM
Citation
 Dyckman, AJDodd, DSMussari, CPSherwood, TCWhiteley, BKGilmore, JLKumar, SRPasunoori, LSrinivas, PVDuraisamy, SKHegde, SAnumula, RK 4-Azaindole compounds US Patent  US10730877 Publication Date 8/4/2020 
Target
Name:
Toll-like receptor 7
Synonyms:
ORF Names:UNQ248/PRO285 TLR7_HUMAN | Toll-like receptor 7 (TLR7)
Type:
Enzyme
Mol. Mass.:
120945.35
Organism:
Homo sapiens (Human)
Description:
Q9NYK1
Residue:
1049
  
Inhibitor
Name:
BDBM428090
Synonyms:
US10544143, Example 525 US11053244, Example 525
Type:
Small organic molecule
Emp. Form.:
C23H28N6
Mol. Mass.:
388.5086
SMILES:
CC(C)c1c([nH]c2cc(C)c(nc12)C1CCNCC1)-c1cc(C)c2ncnn2c1
: