Target
Toll-like receptor 8
Ligand
BDBM428528
Substrate
Meas. Tech.
TLR7/8/9 Inhibition Reporter Assays
IC50
0.250±n/a nM
Citation
 Dyckman, AJDodd, DSMussari, CPSherwood, TCWhiteley, BKGilmore, JLKumar, SRPasunoori, LSrinivas, PVDuraisamy, SKHegde, SAnumula, RK 4-Azaindole compounds US Patent  US10730877 Publication Date 8/4/2020 
Target
Name:
Toll-like receptor 8
Synonyms:
CD_antigen: CD288 TLR8_HUMAN | TRL8
Type:
Enzyme
Mol. Mass.:
119828.77
Organism:
Homo sapiens (Human)
Description:
Q9NR97
Residue:
1041
  
Inhibitor
Name:
BDBM428528
Synonyms:
US10544143, Example 1034 US10730877, Example 1034 | US11053244, Example 1034
Type:
Small organic molecule
Emp. Form.:
C28H38N8O
Mol. Mass.:
502.6543
SMILES:
CNCCC(=O)N1C[C@H](C)N(C[C@H]1C)c1ccc2[nH]c(c(C(C)C)c2n1)-c1cn2ncnc2c(C)c1C
: