Target
Hepatocyte growth factor receptor
Ligand
BDBM50146167
Substrate
Meas. Tech.
In Vitro c-Met Kinase Enzyme Assay
IC50
<500±n/a nM
Citation
 Zhuo, JXu, MHe, CZhang, CQian, DBurns, DMLi, YMetcalf, BYao, W Imidazotriaines and imidazopyrimidines as kinase inhibitors US Patent  US10738052 Publication Date 8/11/2020 
Target
Name:
Hepatocyte growth factor receptor
Synonyms:
Hepatocyte growth factor receptor Hepatocyte growth factor receptor (c-MET) MET Met proto-oncogene (hepatocyte growth factor receptor) Tyrosine-protein kinase Met (c-Met) c-Met kinase
Type:
Protein
Mol. Mass.:
155559.73
Organism:
Homo sapiens (Human)
Description:
P08581
Residue:
1390
  
Inhibitor
Name:
BDBM50146167
Synonyms:
Capmatinib INCB-28060 US10738052, Example 7 US9944645, 7
Type:
Small organic molecule
Emp. Form.:
C23H17FN6O
Mol. Mass.:
412.4191
SMILES:
CNC(=O)c1ccc(cc1F)-c1cnc2ncc(Cc3ccc4ncccc4c3)n2n1
: