Target
Tyrosine-protein kinase JAK2
Ligand
BDBM472916
Substrate
Meas. Tech.
Biochemical JAK Kinase Assays
Ki
0.040±n/a nM
Citation
 Long, DDSmith, CThompson, C 5 to 7 membered heterocyclic amides as JAK inhibitors US Patent  US10836763 Publication Date 11/17/2020 
Target
Name:
Tyrosine-protein kinase JAK2
Synonyms:
JAK-2 JAK2_HUMAN Janus kinase 2 (JAK2) | Janus kinase 2 (a protein tyrosine kinase)
Type:
Protein
Mol. Mass.:
130684.68
Organism:
Homo sapiens (Human)
Description:
O60674
Residue:
1132
  
Inhibitor
Name:
BDBM472916
Synonyms:
US10836763, Example 3 | US11713315, Example 3
Type:
Small organic molecule
Emp. Form.:
C29H35N7O2
Mol. Mass.:
513.6339
SMILES:
CCc1cc(O)ccc1-c1ccc2c(n[nH]c2c1)-c1nc2C[C@H](N(C)Cc2[nH]1)C(=O)N1CCN(C)C[C@@H]1C
: