Target
Non-receptor tyrosine-protein kinase TYK2
Ligand
BDBM472922
Substrate
Meas. Tech.
Biochemical Kinase Assay
IC50
1.58±n/a nM
Citation
 Colson, PFass, GT Process for preparing JAK inhibitors and intermediates thereof US Patent  US10844057 Publication Date 11/24/2020 
Target
Name:
Non-receptor tyrosine-protein kinase TYK2
Synonyms:
Non-receptor tyrosine-protein kinase TYK2 (TYK2) TYK2_HUMAN | Tyrosine-protein kinase TYK2
Type:
Protein
Mol. Mass.:
133666.03
Organism:
Homo sapiens (Human)
Description:
P29597
Residue:
1187
  
Inhibitor
Name:
BDBM472922
Synonyms:
US10836763, Example 5 US11713315, Example 5
Type:
Small organic molecule
Emp. Form.:
C30H37N7O3
Mol. Mass.:
543.6599
SMILES:
CCc1cc(O)ccc1-c1ccc2c(n[nH]c2c1)-c1nc2C[C@H](N(C)Cc2[nH]1)C(=O)N1CCN(CCO)C[C@H]1C
: