Target
Histone deacetylase 3
Ligand
BDBM139295
Substrate
Meas. Tech.
HDAC Enzyme Assays
IC50
158±n/a nM
Citation
 Golonzhka, OJarpe, MB HDAC inhibitors for the treatment of diabetic peripheral neuropathy US Patent  US10858323 Publication Date 12/8/2020 
Target
Name:
Histone deacetylase 3
Synonyms:
HD3 HDAC3_HUMAN Human HDAC3 SMAP45
Type:
Enzyme
Mol. Mass.:
48829.55
Organism:
Homo sapiens (Human)
Description:
O15379
Residue:
428
  
Inhibitor
Name:
BDBM139295
Synonyms:
US10858323, Compound 1 | US8614223, 73
Type:
Small organic molecule
Emp. Form.:
C14H14N4O2
Mol. Mass.:
270.2866
SMILES:
ONC(=O)c1cnc(NC2(CC2)c2ccccc2)nc1
: