Target
D(3) dopamine receptor
Ligand
BDBM476923
Substrate
Meas. Tech.
Binding Assay
Ki
0.048±n/a nM
Citation
 Tobinaga, HMasuda, KInagaki, MYonehara, MMasuda, M Nitrogen-containing condensed ring compounds having dopamine D3 antagonistic effect US Patent  US10870660 Publication Date 12/22/2020 
Target
Name:
D(3) dopamine receptor
Synonyms:
DOPAMINE D3 DRD3_HUMAN Dopamine D3 receptor (D3) Dopamine receptor Dopamine receptor D3
Type:
Mol. Mass.:
44243.43
Organism:
Homo sapiens (Human)
Description:
Residue:
400
  
Inhibitor
Name:
BDBM476923
Synonyms:
US10870660, Compound II-081 | US11345716, Compound II-081
Type:
Small organic molecule
Emp. Form.:
C27H35F3N4O3
Mol. Mass.:
520.587
SMILES:
CCn1c(cccc1=O)C(=O)N[C@H]1CC[C@H](CCN2CCc3ccc(OCC(F)(F)F)nc3CC2)CC1
: