Target
Replicase polyprotein 1ab
Ligand
BDBM476954
Substrate
Meas. Tech.
Enzyme Assays and Inhibition Studies
IC50
740±260 nM
Citation
 Dampalla, CSKim, YBickmeier, NRathnayake, ADNguyen, HNZheng, JKashipathy, MMBaird, MABattaile, KPLovell, SPerlman, SChang, KOGroutas, WC Structure-Guided Design of Conformationally Constrained Cyclohexane Inhibitors of Severe Acute Respiratory Syndrome Coronavirus-2 3CL Protease. J Med Chem 64:10047-10058 (2021)  
Target
Name:
Replicase polyprotein 1ab
Synonyms:
ORF1ab polyprotein pp1ab | rep
Type:
Protein
Mol. Mass.:
794070.71
Organism:
2019-nCoV
Description:
P0DTD1
Residue:
7096
  
Inhibitor
Name:
BDBM476954
Synonyms:
SARS-CoV-2 3CLpro Inhibitors 2n | SARS-CoV-2 3CLpro Inhibitors 2o
Type:
Small organic molecule
Emp. Form.:
C25H39N3O6
Mol. Mass.:
477.5937
SMILES:
CC(C)C[C@H](NC(=O)OCC12CC3CC(CC(O)(C3)C1)C2)C(=O)NC(CC1CCNC1=O)C=O
: