Target
Isoform Tau-F of Microtubule-associated protein tau
Ligand
BDBM50492518
Substrate
Meas. Tech.
In Vitro Inhibition Assay
Ki
30.6±9 nM
Citation
 Routier, SSuzenet, FChalon, SBuron, FVercouillie, JMelki, RBoiaryna, LGuilloteau, DPieri, L Compounds for using in imaging and particularly for the diagnosis of neurodegenerative diseases US Patent  US10906900 Publication Date 2/2/2021 
Target
Name:
Isoform Tau-F of Microtubule-associated protein tau
Synonyms:
MAPT MTBT1 Microtubule-associated protein Tau isoform 2N4R (Tau 2N4R) TAU | TAU_HUMAN
Type:
Enzyme Catalytic Domain
Mol. Mass.:
45857.42
Organism:
Homo sapiens (Human)
Description:
P10636-8
Residue:
441
  
Inhibitor
Name:
BDBM50492518
Synonyms:
Florbetapir | US10906900, AV45
Type:
Small organic molecule
Emp. Form.:
C20H25FN2O3
Mol. Mass.:
360.4225
SMILES:
CNc1ccc(\C=C\c2ccc(OCCOCCOCCF)nc2)cc1
: