Target
Bromodomain-containing protein 4
Ligand
BDBM284983
Substrate
Meas. Tech.
In Vitro Enzyme Inhibition Assay
IC50
<500±n/a nM
Citation
 Boloor, A Bromodomain inhibitors US Patent  US10941160 Publication Date 3/9/2021 
Target
Name:
Bromodomain-containing protein 4
Synonyms:
BRD4 Bromodomain-containing protein 4 (BRD4) Protein HUNK1
Type:
Protein
Mol. Mass.:
152264.84
Organism:
Homo sapiens (Human)
Description:
O60885
Residue:
1362
  
Inhibitor
Name:
BDBM284983
Synonyms:
N-[3-(2-methyl-1-oxoisoquinolin-4-yl) phenyl]propane-1-sulfonamide US10941160, Example 28
Type:
Small organic molecule
Emp. Form.:
C19H20N2O3S
Mol. Mass.:
356.439
SMILES:
CCCS(=O)(=O)Nc1cccc(c1)-c1cn(C)c(=O)c2ccccc12
: