Target
Bromodomain-containing protein 4
Ligand
BDBM285022
Substrate
Meas. Tech.
In Vitro Enzyme Inhibition Assay
IC50
>5000±n/a nM
Citation
 Boloor, A Bromodomain inhibitors US Patent  US10941160 Publication Date 3/9/2021 
Target
Name:
Bromodomain-containing protein 4
Synonyms:
BRD4 Bromodomain-containing protein 4 (BRD4) Protein HUNK1
Type:
Protein
Mol. Mass.:
152264.84
Organism:
Homo sapiens (Human)
Description:
O60885
Residue:
1362
  
Inhibitor
Name:
BDBM285022
Synonyms:
2-methyl-4-(1,3-oxazol-2-yl)isoquinolin- 1-one US10941160, Example 67
Type:
Small organic molecule
Emp. Form.:
C13H10N2O2
Mol. Mass.:
226.2307
SMILES:
Cn1cc(-c2ncco2)c2ccccc2c1=O
: