Target
Bromodomain-containing protein 4
Ligand
BDBM486263
Substrate
Meas. Tech.
In Vitro Enzyme Inhibition Assay
IC50
<500±n/a nM
Citation
 Boloor, A Bromodomain inhibitors US Patent  US10941160 Publication Date 3/9/2021 
Target
Name:
Bromodomain-containing protein 4
Synonyms:
BRD4 Bromodomain-containing protein 4 (BRD4) Protein HUNK1
Type:
Protein
Mol. Mass.:
152264.84
Organism:
Homo sapiens (Human)
Description:
O60885
Residue:
1362
  
Inhibitor
Name:
BDBM486263
Synonyms:
5-[2-(cyclopropylmethylamino)-5- ethylsulfonylphenyl]-1-methylpyridin-2-one | US10941160, Example 473
Type:
Small organic molecule
Emp. Form.:
C18H24N2O3S
Mol. Mass.:
348.46
SMILES:
CCS(O)(O)c1ccc(NCC2CC2)c(c1)-c1ccc(=O)n(C)c1
: