Target
Bromodomain-containing protein 4
Ligand
BDBM285420
Substrate
Meas. Tech.
In Vitro Enzyme Inhibition Assay
IC50
<500±n/a nM
Citation
 Boloor, A Bromodomain inhibitors US Patent  US10941160 Publication Date 3/9/2021 
Target
Name:
Bromodomain-containing protein 4
Synonyms:
BRD4 Bromodomain-containing protein 4 (BRD4) Protein HUNK1
Type:
Protein
Mol. Mass.:
152264.84
Organism:
Homo sapiens (Human)
Description:
O60885
Residue:
1362
  
Inhibitor
Name:
BDBM285420
Synonyms:
5-[2-(cyclopropylmethoxy)-5- methylsulfonylphenyl]-3-(dimethylamino)- 1-methylpyridin-2-one US10023592, Example 474
Type:
Small organic molecule
Emp. Form.:
C19H24N2O4S
Mol. Mass.:
376.47
SMILES:
CN(C)c1cc(cn(C)c1=O)-c1cc(ccc1OCC1CC1)S(C)(=O)=O
: