Target
Bromodomain-containing protein 4
Ligand
BDBM285442
Substrate
Meas. Tech.
In Vitro Enzyme Inhibition Assay
IC50
<500±n/a nM
Citation
 Boloor, A Bromodomain inhibitors US Patent  US10941160 Publication Date 3/9/2021 
Target
Name:
Bromodomain-containing protein 4
Synonyms:
BRD4 Bromodomain-containing protein 4 (BRD4) Protein HUNK1
Type:
Protein
Mol. Mass.:
152264.84
Organism:
Homo sapiens (Human)
Description:
O60885
Residue:
1362
  
Inhibitor
Name:
BDBM285442
Synonyms:
N-[2-cyclopropyl-7-(1,5-dimethyl-6- oxopyridin-3-yl)-2,3-dihydro-1- benzofuran-5-yl]ethanesulfonamide US10941160, Example 496
Type:
Small organic molecule
Emp. Form.:
C20H24N2O4S
Mol. Mass.:
388.481
SMILES:
CCS(=O)(=O)Nc1cc2CC(Oc2c(c1)-c1cc(C)c(=O)n(C)c1)C1CC1
: