Target
Tyrosine-protein kinase JAK2
Ligand
BDBM473568
Substrate
Meas. Tech.
Biochemical JAK Kinase Assays
Ki
0.016±n/a nM
Citation
 Long, DDSmith, CThompson, C Dimethyl amino azetidine amides as JAK inhibitors US Patent  US10947229 Publication Date 3/16/2021 
Target
Name:
Tyrosine-protein kinase JAK2
Synonyms:
JAK-2 JAK2_HUMAN Janus kinase 2 (JAK2) | Janus kinase 2 (a protein tyrosine kinase)
Type:
Protein
Mol. Mass.:
130684.68
Organism:
Homo sapiens (Human)
Description:
O60674
Residue:
1132
  
Inhibitor
Name:
BDBM473568
Synonyms:
US10844057, Example 11 US11634419, Example 4
Type:
Small organic molecule
Emp. Form.:
C31H39N7O2
Mol. Mass.:
541.6871
SMILES:
CCc1cc(O)ccc1-c1ccc2c(n[nH]c2c1)-c1nc2C[C@H](N(Cc2[nH]1)C(C)C)C(=O)N1CC(C)(C1)N(C)C
: