Target
Free fatty acid receptor 1
Ligand
BDBM301722
Substrate
Meas. Tech.
Pharmacological Assay
EC50
18.0±n/a nM
Citation
 Eckhardt, MFrattini, SLangkopf, EWagner, H Indanyloxydihydrobenzofuranylacetic acids US Patent  US9597310 Publication Date 3/21/2017 
Target
Name:
Free fatty acid receptor 1
Synonyms:
FFAR1 G-protein Coupled Receptor 40 | GPR40
Type:
G Protein-Coupled Receptor (GPCR)
Mol. Mass.:
31473.32
Organism:
Homo sapiens (Human)
Description:
O14842
Residue:
300
  
Inhibitor
Name:
BDBM301722
Synonyms:
US9597310, 12 | {(S)-6-[(R)-7-Fluoro-4-(4-morpholin-4-ylmethyl-phenoxy)-indan-1-yloxy]-2,3-dihydro-benzofuran-3-yl}-acetic acid methyl ester
Type:
Small organic molecule
Emp. Form.:
C31H32FNO6
Mol. Mass.:
533.5873
SMILES:
COC(=O)C[C@@H]1COc2cc(O[C@@H]3CCc4c3c(F)ccc4Oc3ccc(CN4CCOCC4)cc3)ccc12
: