Target
Free fatty acid receptor 1
Ligand
BDBM301724
Substrate
Meas. Tech.
Pharmacological Assay
EC50
23.0±n/a nM
Citation
 Eckhardt, MFrattini, SLangkopf, EWagner, H Indanyloxydihydrobenzofuranylacetic acids US Patent  US9597310 Publication Date 3/21/2017 
Target
Name:
Free fatty acid receptor 1
Synonyms:
FFAR1 G-protein Coupled Receptor 40 | GPR40
Type:
G Protein-Coupled Receptor (GPCR)
Mol. Mass.:
31473.32
Organism:
Homo sapiens (Human)
Description:
O14842
Residue:
300
  
Inhibitor
Name:
BDBM301724
Synonyms:
US9597310, 14 | [(S)-6-{(R)-4-[3-(Acetylamino-methyl)-phenoxy]-7-fluoro-indan-1-yloxy}-2,3-dihydro-benzofuran-3-yl]-acetic acid methyl ester
Type:
Small organic molecule
Emp. Form.:
C29H28FNO6
Mol. Mass.:
505.5341
SMILES:
COC(=O)C[C@@H]1COc2cc(O[C@@H]3CCc4c3c(F)ccc4Oc3cccc(CNC(C)=O)c3)ccc12
: