Target
Free fatty acid receptor 1
Ligand
BDBM301735
Substrate
Meas. Tech.
Pharmacological Assay
EC50
6.00±n/a nM
Citation
 Eckhardt, MFrattini, SLangkopf, EWagner, H Indanyloxydihydrobenzofuranylacetic acids US Patent  US9597310 Publication Date 3/21/2017 
Target
Name:
Free fatty acid receptor 1
Synonyms:
FFAR1 G-protein Coupled Receptor 40 | GPR40
Type:
G Protein-Coupled Receptor (GPCR)
Mol. Mass.:
31473.32
Organism:
Homo sapiens (Human)
Description:
O14842
Residue:
300
  
Inhibitor
Name:
BDBM301735
Synonyms:
US9597310, 25 | {(S)-6-[(R)-4-(Benzo[d][1,3]dioxol-5-yloxy)-7-fluoro-indan-1-yloxy]-2,3-dihydrobenzofuran-3-yl}-acetic acid
Type:
Small organic molecule
Emp. Form.:
C26H21FO7
Mol. Mass.:
464.4391
SMILES:
OC(=O)C[C@@H]1COc2cc(O[C@@H]3CCc4c3c(F)ccc4Oc3ccc4OCOc4c3)ccc12
: