Target
Free fatty acid receptor 1
Ligand
BDBM301757
Substrate
Meas. Tech.
Pharmacological Assay
EC50
8.00±n/a nM
Citation
 Eckhardt, MFrattini, SLangkopf, EWagner, H Indanyloxydihydrobenzofuranylacetic acids US Patent  US9597310 Publication Date 3/21/2017 
Target
Name:
Free fatty acid receptor 1
Synonyms:
FFAR1 G-protein Coupled Receptor 40 | GPR40
Type:
G Protein-Coupled Receptor (GPCR)
Mol. Mass.:
31473.32
Organism:
Homo sapiens (Human)
Description:
O14842
Residue:
300
  
Inhibitor
Name:
BDBM301757
Synonyms:
((S)-6-{(R)-4-[2-Cyano-4-(3-hydroxy-3-methylbutoxy)phenoxy]-7-fluoro-indan-1-yloxy}-2,3-dihydrobenzofuran-3-yl)-acetic acid | US9597310, 47
Type:
Small organic molecule
Emp. Form.:
C31H30FNO7
Mol. Mass.:
547.5708
SMILES:
CC(C)(O)CCOc1ccc(Oc2ccc(F)c3[C@@H](CCc23)Oc2ccc3[C@H](CC(O)=O)COc3c2)c(c1)C#N
: