Target
Leucine-rich repeat serine/threonine-protein kinase 2 [970-2527,G2019S]
Ligand
BDBM254929
Substrate
Meas. Tech.
LanthaScreen Kinase Activity Assay
EC50
17±n/a nM
Citation
 PubChem, PCBedford, STChen, IWang, YWilliamson, DS Arylpyrrolopyridine derived compounds as LRRK2 inhibitors US Patent  US9675594 Publication Date 6/13/2017 
Target
Name:
Leucine-rich repeat serine/threonine-protein kinase 2 [970-2527,G2019S]
Synonyms:
LRRK2 Leucine-rich repeat serine/threonine-protein kinase 2 (LRRK2) (G2019S) PARK8
Type:
Protein
Mol. Mass.:
177347.59
Organism:
Homo sapiens (Human)
Description:
Human LRRK2 variant (970-2527aa) with G2019S mutation
Residue:
1558
  
Inhibitor
Name:
BDBM254929
Synonyms:
US9499542, 12 | US9675594, 12
Type:
Small organic molecule
Emp. Form.:
C15H12N4
Mol. Mass.:
248.2826
SMILES:
Cc1cccc(c1)-c1cc(N)nc2[nH]cc(C#N)c12
: