Target
Leucine-rich repeat serine/threonine-protein kinase 2 [970-2527]
Ligand
BDBM254938
Substrate
Meas. Tech.
LanthaScreen Kinase Activity Assay
EC50
393±n/a nM
Citation
 PubChem, PCBedford, STChen, IWang, YWilliamson, DS Arylpyrrolopyridine derived compounds as LRRK2 inhibitors US Patent  US9675594 Publication Date 6/13/2017 
Target
Name:
Leucine-rich repeat serine/threonine-protein kinase 2 [970-2527]
Synonyms:
LRRK2 Leucine-rich repeat kinase 2 (LRRK2 t-WT) PARK8
Type:
Protein
Mol. Mass.:
177317.56
Organism:
Homo sapiens (Human)
Description:
Human LRRK2 variant (970-2527aa)
Residue:
1558
  
Inhibitor
Name:
BDBM254938
Synonyms:
US9499542, 21 | US9675594, 21
Type:
Small organic molecule
Emp. Form.:
C19H14F3N7
Mol. Mass.:
397.3566
SMILES:
Cc1cccc(n1)-c1cc(Nc2nn(C)cc2C(F)(F)F)nc2[nH]cc(C#N)c12
: