Target
Mast/stem cell growth factor receptor Kit
Ligand
BDBM301791
Substrate
Meas. Tech.
KIT Kinase Assay
IC50
61.0±n/a nM
Citation
 Lombardi Borgia, ACiomei, MDonati, DNesi, M Substituted indazole derivatives active as kinase inhibitiors US Patent  US9597317 Publication Date 3/21/2017 
Target
Name:
Mast/stem cell growth factor receptor Kit
Synonyms:
CD117 antigen KIT Mast/stem cell growth factor receptor Kit (cKIT) Proto-oncogene tyrosine-protein kinase Kit Stem cell growth factor receptor Tyrosine-protein kinase Kit c-kit v-kit Hardy-Zuckerman 4 feline sarcoma viral oncogene homolog
Type:
Protein
Mol. Mass.:
109869.37
Organism:
Homo sapiens (Human)
Description:
P10721
Residue:
976
  
Inhibitor
Name:
BDBM301791
Synonyms:
N-[6-(2-Benzyloxy-ethoxy)-1H-indazol-3-yl]-(1-methyl-piperidin-4-ylamino)-benzamide | US9597317, 19
Type:
Small organic molecule
Emp. Form.:
C29H33N5O3
Mol. Mass.:
499.604
SMILES:
CN1CCC(CC1)Nc1ccccc1C(=O)Nc1n[nH]c2cc(OCCOCc3ccccc3)ccc12
: