Target
Indoleamine 2,3-dioxygenase 1
Ligand
BDBM223010
Substrate
Meas. Tech.
Enzyme Assay
IC50
<100.0±n/a nM
Citation
 Gajewski, TFSpranger, SLeung, M Synergistic combination of immunologic inhibitors for the treatment of cancer US Patent  US10967060 Publication Date 4/6/2021 
Target
Name:
Indoleamine 2,3-dioxygenase 1
Synonyms:
I23O1_HUMAN IDO-1 INDO Indoleamine 2,3-dioxygenase | Indoleamine-pyrrole 2,3-dioxygenase
Type:
Enzyme
Mol. Mass.:
45330.80
Organism:
Homo sapiens (Human)
Description:
P14902
Residue:
403
  
Inhibitor
Name:
BDBM223010
Synonyms:
US10034939, Example 12 US11207302, Example 12 US9789094, 12
Type:
Small organic molecule
Emp. Form.:
C14H16F4N6O4S
Mol. Mass.:
440.373
SMILES:
CS(=O)(=O)NCCCNc1nonc1C(Nc1ccc(F)c(c1)C(F)(F)F)=NO
: