Target
Fatty acid-binding protein, heart
Ligand
BDBM489700
Substrate
Meas. Tech.
High Throughput Fluorescence Displacement Assay
Ki
100.0±n/a nM
Citation
 Ojima, IDeutsch, DKaczocha, MHu, KTong, SElmes, MYan, S Alpha-truxillic acid derivatives and pharmaceutical compositions thereof US Patent  US10968163 Publication Date 4/6/2021 
Target
Name:
Fatty acid-binding protein, heart
Synonyms:
FABP11 FABPH_HUMAN MDGI
Type:
PROTEIN
Mol. Mass.:
14858.36
Organism:
Homo sapiens (Human)
Description:
ChEMBL_1463784
Residue:
133
  
Inhibitor
Name:
BDBM489700
Synonyms:
US10968163, Compound 3-B
Type:
Small organic molecule
Emp. Form.:
C26H23O5
Mol. Mass.:
415.4584
SMILES:
COc1ccc(COC(=O)C2C(C(C2c2ccccc2)C([O-])=O)c2ccccc2)cc1
: