Target
Fatty acid-binding protein, heart
Ligand
BDBM50468452
Substrate
Meas. Tech.
High Throughput Fluorescence Displacement Assay
Ki
100.0±n/a nM
Citation
 Ojima, IDeutsch, DKaczocha, MHu, KTong, SElmes, MYan, S Alpha-truxillic acid derivatives and pharmaceutical compositions thereof US Patent  US10968163 Publication Date 4/6/2021 
Target
Name:
Fatty acid-binding protein, heart
Synonyms:
FABP11 FABPH_HUMAN MDGI
Type:
PROTEIN
Mol. Mass.:
14858.36
Organism:
Homo sapiens (Human)
Description:
ChEMBL_1463784
Residue:
133
  
Inhibitor
Name:
BDBM50468452
Synonyms:
CHEMBL4283759 | US10968163, Compound 3e
Type:
Small organic molecule
Emp. Form.:
C24H19IO4
Mol. Mass.:
498.3097
SMILES:
OC(=O)[C@H]1[C@@H]([C@@H]([C@H]1c1ccccc1)C(=O)Oc1ccccc1I)c1ccccc1
: