Target
Fatty acid-binding protein 5
Ligand
BDBM50468462
Substrate
Meas. Tech.
High Throughput Fluorescence Displacement Assay
Ki
80.0±n/a nM
Citation
 Ojima, IDeutsch, DKaczocha, MHu, KTong, SElmes, MYan, S Alpha-truxillic acid derivatives and pharmaceutical compositions thereof US Patent  US10968163 Publication Date 4/6/2021 
Target
Name:
Fatty acid-binding protein 5
Synonyms:
FABP5 Fatty acid binding protein epidermal | Fatty acid-binding protein 5 (FABP5)
Type:
Enzyme
Mol. Mass.:
15164.79
Organism:
Homo sapiens (Human)
Description:
Q01469
Residue:
135
  
Inhibitor
Name:
BDBM50468462
Synonyms:
CHEMBL4287117 US20230365488, Compound 1z
Type:
Small organic molecule
Emp. Form.:
C30H24O4
Mol. Mass.:
448.5092
SMILES:
OC(=O)[C@H]1[C@@H]([C@@H]([C@H]1c1ccccc1)C(=O)Oc1ccccc1-c1ccccc1)c1ccccc1
: