Target
Fatty acid-binding protein, heart
Ligand
BDBM50468456
Substrate
Meas. Tech.
High Throughput Fluorescence Displacement Assay
Ki
180±n/a nM
Citation
 Ojima, IDeutsch, DKaczocha, MHu, KTong, SElmes, MYan, S Alpha-truxillic acid derivatives and pharmaceutical compositions thereof US Patent  US10968163 Publication Date 4/6/2021 
Target
Name:
Fatty acid-binding protein, heart
Synonyms:
FABP11 FABPH_HUMAN MDGI
Type:
PROTEIN
Mol. Mass.:
14858.36
Organism:
Homo sapiens (Human)
Description:
ChEMBL_1463784
Residue:
133
  
Inhibitor
Name:
BDBM50468456
Synonyms:
CHEMBL4278244 | US10968163, Compound 3o
Type:
Small organic molecule
Emp. Form.:
C30H25NO5
Mol. Mass.:
479.5232
SMILES:
CC(=O)Nc1ccc2c(OC(=O)[C@H]3[C@H]([C@@H]([C@@H]3c3ccccc3)C(O)=O)c3ccccc3)cccc2c1
: