Target
Fatty acid-binding protein, heart
Ligand
BDBM50468443
Substrate
Meas. Tech.
High Throughput Fluorescence Displacement Assay
Ki
170±n/a nM
Citation
 Ojima, IDeutsch, DKaczocha, MHu, KTong, SElmes, MYan, S Alpha-truxillic acid derivatives and pharmaceutical compositions thereof US Patent  US10968163 Publication Date 4/6/2021 
Target
Name:
Fatty acid-binding protein, heart
Synonyms:
FABP11 FABPH_HUMAN MDGI
Type:
PROTEIN
Mol. Mass.:
14858.36
Organism:
Homo sapiens (Human)
Description:
ChEMBL_1463784
Residue:
133
  
Inhibitor
Name:
BDBM50468443
Synonyms:
CHEMBL4287414 US20230365488, Compound 1y
Type:
Small organic molecule
Emp. Form.:
C30H26O6
Mol. Mass.:
482.5238
SMILES:
COc1ccccc1[C@H]1[C@@H]([C@@H]([C@H]1C(=O)Oc1cccc2ccccc12)c1ccccc1OC)C(O)=O
: