Target
Interleukin-1 receptor-associated kinase 4
Ligand
BDBM494225
Substrate
Meas. Tech.
Biological Assay
Ki
1.40±n/a nM
Citation
 Bryan, MCGobbi, AKiefer, Jr., JRKolesnikov, AOlivero, AGDrobnick, JLiang, JRajapaksa, NNdubaku, CFeng, J Pyrazolo[1,5a]pyrimidine derivatives as IRAK4 modulators US Patent  US10988478 Publication Date 4/27/2021 
Target
Name:
Interleukin-1 receptor-associated kinase 4
Synonyms:
IRAK-4 IRAK4_HUMAN Interleukin-1 receptor-associated kinase 4 (IRAK4) | Renal carcinoma antigen NY-REN-64
Type:
Protein
Mol. Mass.:
51519.08
Organism:
Homo sapiens (Human)
Description:
Q9NWZ3
Residue:
460
  
Inhibitor
Name:
BDBM494225
Synonyms:
(R)-N-(6-(4-cyanopiperidin- 1-yl)-2-(2-fluoro-3-hydroxy- 3-methylbutyl)-1- oxoisoindolin-5- yl)pyrazolo[1,5- a]pyrimidine-3-carboxamide | US10988478, Example 274
Type:
Small organic molecule
Emp. Form.:
C26H28FN7O3
Mol. Mass.:
505.544
SMILES:
CC(C)(O)[C@H](F)CN1Cc2cc(NC(=O)c3cnn4cccnc34)c(cc2C1=O)N1CCC(CC1)C#N
: