Target
Interleukin-1 receptor-associated kinase 4
Ligand
BDBM494463
Substrate
Meas. Tech.
Biological Assay
Ki
1.10±n/a nM
Citation
 Bryan, MCGobbi, AKiefer, Jr., JRKolesnikov, AOlivero, AGDrobnick, JLiang, JRajapaksa, NNdubaku, CFeng, J Pyrazolo[1,5a]pyrimidine derivatives as IRAK4 modulators US Patent  US10988478 Publication Date 4/27/2021 
Target
Name:
Interleukin-1 receptor-associated kinase 4
Synonyms:
IRAK-4 IRAK4_HUMAN Interleukin-1 receptor-associated kinase 4 (IRAK4) | Renal carcinoma antigen NY-REN-64
Type:
Protein
Mol. Mass.:
51519.08
Organism:
Homo sapiens (Human)
Description:
Q9NWZ3
Residue:
460
  
Inhibitor
Name:
BDBM494463
Synonyms:
(S)-N-(3-(cyanomethyl)- 3-methyl-7- morpholinochroman-6- yl)pyrazolo[1,5-a] pyrimidine-3- carboxamide | US10988478, Example 520
Type:
Small organic molecule
Emp. Form.:
C23H24N6O3
Mol. Mass.:
432.4751
SMILES:
C[C@]1(CC#N)COc2cc(N3CCOCC3)c(NC(=O)c3cnn4cccnc34)cc2C1
: