Target
Interleukin-1 receptor-associated kinase 4
Ligand
BDBM494500
Substrate
Meas. Tech.
Biological Assay
Ki
1.90±n/a nM
Citation
 Bryan, MCGobbi, AKiefer, Jr., JRKolesnikov, AOlivero, AGDrobnick, JLiang, JRajapaksa, NNdubaku, CFeng, J Pyrazolo[1,5a]pyrimidine derivatives as IRAK4 modulators US Patent  US10988478 Publication Date 4/27/2021 
Target
Name:
Interleukin-1 receptor-associated kinase 4
Synonyms:
IRAK-4 IRAK4_HUMAN Interleukin-1 receptor-associated kinase 4 (IRAK4) | Renal carcinoma antigen NY-REN-64
Type:
Protein
Mol. Mass.:
51519.08
Organism:
Homo sapiens (Human)
Description:
Q9NWZ3
Residue:
460
  
Inhibitor
Name:
BDBM494500
Synonyms:
N-(2-((2R,3R)-2-fluoro-3- hydroxybutyl)-6- morpholino-1- oxoisoindolin-5- yl)pyrazolo[1,5- a]pyrimidine-3- carboxamide | US10988478, Example 562
Type:
Small organic molecule
Emp. Form.:
C23H25FN6O4
Mol. Mass.:
468.4808
SMILES:
C[C@@H](O)[C@H](F)CN1Cc2cc(NC(=O)c3cnn4cccnc34)c(cc2C1=O)N1CCOCC1
: