Target
Nuclear receptor ROR-alpha
Ligand
BDBM498079
Substrate
Meas. Tech.
Receptor Competition Binding Assay
Ki
19340±n/a nM
Citation
 Clarke, CALugar, III, CWMorphy, JRRichardson, TIRudyk, HSapmaz, SStites, REVaught, GM Compounds useful for inhibiting RORγt US Patent  US11008336 Publication Date 5/18/2021 
Target
Name:
Nuclear receptor ROR-alpha
Synonyms:
NR1F1 Nuclear receptor subfamily 1 group F member 1 RORA RZRA | Retinoid-related orphan receptor-alpha
Type:
PROTEIN
Mol. Mass.:
58976.26
Organism:
Homo sapiens (Human)
Description:
ChEMBL_101591
Residue:
523
  
Inhibitor
Name:
BDBM498079
Synonyms:
(5'S)-N-{[5- (Ethylsulfonyl)pyridin- 2-yl]methyl}-5'- methyl-1-{1-[2- (trifluoromethyl)-1,3- thiazol-5-yl]ethyl}- 4',5'- dihydrospiro[piperidine- 4,7'-thieno[2,3- c]pyran]-2'- carboxamide isomer 2 | US11008336, Example 55
Type:
Small organic molecule
Emp. Form.:
C27H31F3N4O4S3
Mol. Mass.:
628.75
SMILES:
CCS(=O)(=O)c1ccc(CNC(=O)c2cc3C[C@H](C)OC4(CCN(CC4)C(C)c4cnc(s4)C(F)(F)F)c3s2)nc1
: