Target
Nuclear receptor ROR-alpha
Ligand
BDBM498080
Substrate
Meas. Tech.
Receptor Competition Binding Assay
Ki
3271±4105 nM
Citation
 Clarke, CALugar, III, CWMorphy, JRRichardson, TIRudyk, HSapmaz, SStites, REVaught, GM Compounds useful for inhibiting RORγt US Patent  US11008336 Publication Date 5/18/2021 
Target
Name:
Nuclear receptor ROR-alpha
Synonyms:
NR1F1 Nuclear receptor subfamily 1 group F member 1 RORA RZRA | Retinoid-related orphan receptor-alpha
Type:
PROTEIN
Mol. Mass.:
58976.26
Organism:
Homo sapiens (Human)
Description:
ChEMBL_101591
Residue:
523
  
Inhibitor
Name:
BDBM498080
Synonyms:
1-[(1S)-1-(4- Cyanophenyl)ethyl]- N-[4- (ethylsulfonyl)benzyl]- 4',5'- dihydrospiro[piperidine- 4,7'-thieno[2,3- c]pyran]-2'- carboxamide | US11008336, Example 64
Type:
Small organic molecule
Emp. Form.:
C30H33N3O4S2
Mol. Mass.:
563.731
SMILES:
CCS(=O)(=O)c1ccc(CNC(=O)c2cc3CCOC4(CCN(CC4)[C@@H](C)c4ccc(cc4)C#N)c3s2)cc1
: