Target
Macrophage colony-stimulating factor 1 receptor
Ligand
BDBM501710
Substrate
Meas. Tech.
Biochemical Assay
IC50
<100±n/a nM
Citation
 Gamage, SAShepherd, PRFlanagan, JURewcastle, GWMarshall, AJBuchanan, CMLu, GBonnet, MJamieson, SMDenny, WA Tricyclic heterocyclic derivatives and uses thereof US Patent  US11028064 Publication Date 6/8/2021 
Target
Name:
Macrophage colony-stimulating factor 1 receptor
Synonyms:
CSF1R FMS Macrophage colony stimulating factor receptor Macrophage colony-stimulating factor 1 receptor (c-FMS) Proto-oncogene c-Fms c-fms | cFMS
Type:
Protein
Mol. Mass.:
107979.48
Organism:
Homo sapiens (Human)
Description:
P07333
Residue:
972
  
Inhibitor
Name:
BDBM501710
Synonyms:
4-(2-(Dimethylamino)ethoxy)-2-methyl-6-((6-(3-morpholino-3-oxopropyl)pyridin-3-yl)oxy)-9H-xanthen-9-one | US11028064, Example 24
Type:
Small organic molecule
Emp. Form.:
C30H33N3O6
Mol. Mass.:
531.5995
SMILES:
CN(C)CCOc1cc(C)cc2c1oc1cc(Oc3ccc(CCC(=O)N4CCOCC4)nc3)ccc1c2=O
: