Target
Macrophage colony-stimulating factor 1 receptor
Ligand
BDBM501717
Substrate
Meas. Tech.
Biochemical Assay
IC50
<100±n/a nM
Citation
 Gamage, SAShepherd, PRFlanagan, JURewcastle, GWMarshall, AJBuchanan, CMLu, GBonnet, MJamieson, SMDenny, WA Tricyclic heterocyclic derivatives and uses thereof US Patent  US11028064 Publication Date 6/8/2021 
Target
Name:
Macrophage colony-stimulating factor 1 receptor
Synonyms:
CSF1R FMS Macrophage colony stimulating factor receptor Macrophage colony-stimulating factor 1 receptor (c-FMS) Proto-oncogene c-Fms c-fms | cFMS
Type:
Protein
Mol. Mass.:
107979.48
Organism:
Homo sapiens (Human)
Description:
P07333
Residue:
972
  
Inhibitor
Name:
BDBM501717
Synonyms:
3-((5-(3-(Dimethylamino)propoxy)-7-methyl-9-oxo-9H-xanthen-3-yl)oxy)-N-phenylbenzamide | US11028064, Example 31
Type:
Small organic molecule
Emp. Form.:
C32H30N2O5
Mol. Mass.:
522.591
SMILES:
CN(C)CCCOc1cc(C)cc2c1oc1cc(Oc3cccc(c3)C(=O)Nc3ccccc3)ccc1c2=O
: