Target
Macrophage colony-stimulating factor 1 receptor
Ligand
BDBM501750
Substrate
Meas. Tech.
Biochemical Assay
IC50
<100±n/a nM
Citation
 Gamage, SAShepherd, PRFlanagan, JURewcastle, GWMarshall, AJBuchanan, CMLu, GBonnet, MJamieson, SMDenny, WA Tricyclic heterocyclic derivatives and uses thereof US Patent  US11028064 Publication Date 6/8/2021 
Target
Name:
Macrophage colony-stimulating factor 1 receptor
Synonyms:
CSF1R FMS Macrophage colony stimulating factor receptor Macrophage colony-stimulating factor 1 receptor (c-FMS) Proto-oncogene c-Fms c-fms | cFMS
Type:
Protein
Mol. Mass.:
107979.48
Organism:
Homo sapiens (Human)
Description:
P07333
Residue:
972
  
Inhibitor
Name:
BDBM501750
Synonyms:
N-Cyclopentyl-3-(5-((5-(3-((2R,6S)-2,6-dimethylpiperidin-1-yl)propoxy)-7-methyl-9-oxo-9H-xanthen-3-yl)oxy)pyridin-2-yl)propanamide | US11028064, Example 64
Type:
Small organic molecule
Emp. Form.:
C37H45N3O5
Mol. Mass.:
611.7703
SMILES:
C[C@H]1CCC[C@@H](C)N1CCCOc1cc(C)cc2c1oc1cc(Oc3ccc(CCC(=O)NC4CCCC4)nc3)ccc1c2=O
: