Target
Nuclear receptor ROR-gamma
Ligand
BDBM504166
Substrate
Meas. Tech.
Transcreener-Fluorecescence Polarization Assay
Ki
3.70±n/a nM
Citation
 Bryan, MCDo, SDrobnick, JGobbi, AKatsumoto, TKiefer, Jr., JRLiang, JRajapaksa, NSChen, YFu, LLai, KWLiu, ZWai, JWang, F Pyrazolo[ 1,5a]pyrimidine derivatives as IRAK4 modulators US Patent  US11034698 Publication Date 6/15/2021 
Target
Name:
Nuclear receptor ROR-gamma
Synonyms:
NR1F3 Nuclear receptor ROR-gamma (RORC) RAR-related orphan receptor C (RORc) RORG RZRG Retinoid-related orphan receptor-gamma (RORc)
Type:
Enzyme Catalytic Domain
Mol. Mass.:
58218.40
Organism:
Homo sapiens (Human)
Description:
P51449
Residue:
518
  
Inhibitor
Name:
BDBM504166
Synonyms:
N-(6-(4-(2-Acetamidoethyl)piperazin-1-yl)-2,2-dimethyl-2,3-dihydrobenzofuran-5-yl)pyrazolo[1,5-a]pyrimidine-3-carboxamide | US11034698, Example 3
Type:
Small organic molecule
Emp. Form.:
C25H31N7O3
Mol. Mass.:
477.5587
SMILES:
CC(=O)NCCN1CCN(CC1)c1cc2OC(C)(C)Cc2cc1NC(=O)c1cnn2cccnc12
: