Target
Nuclear receptor ROR-gamma
Ligand
BDBM504245
Substrate
Meas. Tech.
Transcreener-Fluorecescence Polarization Assay
Ki
4.90±n/a nM
Citation
 Bryan, MCDo, SDrobnick, JGobbi, AKatsumoto, TKiefer, Jr., JRLiang, JRajapaksa, NSChen, YFu, LLai, KWLiu, ZWai, JWang, F Pyrazolo[ 1,5a]pyrimidine derivatives as IRAK4 modulators US Patent  US11034698 Publication Date 6/15/2021 
Target
Name:
Nuclear receptor ROR-gamma
Synonyms:
NR1F3 Nuclear receptor ROR-gamma (RORC) RAR-related orphan receptor C (RORc) RORG RZRG Retinoid-related orphan receptor-gamma (RORc)
Type:
Enzyme Catalytic Domain
Mol. Mass.:
58218.40
Organism:
Homo sapiens (Human)
Description:
P51449
Residue:
518
  
Inhibitor
Name:
BDBM504245
Synonyms:
N-[6-Morpholino-2-(2- oxaspiro[3,3]heptan-6-yl)-1- oxo-isoindolin-5- yl]pyrazolo[1,5-a]pyrimidine-3- carboxamide | US11034698, Example 94
Type:
Small organic molecule
Emp. Form.:
C25H26N6O4
Mol. Mass.:
474.5117
SMILES:
O=C(Nc1cc2CN(C3CC4(COC4)C3)C(=O)c2cc1N1CCOCC1)c1cnn2cccnc12
: