Target
Epidermal growth factor receptor
Ligand
BDBM504410
Substrate
Meas. Tech.
Kinase Assay
IC50
0.017±n/a nM
Citation
 Liu, XDing, CZChen, SWu, LHu, LWan, H Quinazoline compound for EGFR inhibition US Patent  US11040984 Publication Date 6/22/2021 
Target
Name:
Epidermal growth factor receptor
Synonyms:
EGF Receptor Substrate EGFR_HUMAN ERBB1 Epidermal Growth Factor Receptor erbB-1 Epidermal growth factor receptor (EGFR) HER1 Proto-oncogene c-ErbB-1 Tyrosine-Protein Kinase ErbB-1
Type:
Receptor Kinase Domain
Mol. Mass.:
134279.59
Organism:
Homo sapiens (Human)
Description:
P00533
Residue:
1210
  
Inhibitor
Name:
BDBM504410
Synonyms:
US11040984, Compound 12
Type:
Small organic molecule
Emp. Form.:
C22H21ClFN5O2
Mol. Mass.:
441.886
SMILES:
CN1CCC2(CN(C(=O)O2)c2ccc3ncnc(Nc4cccc(Cl)c4F)c3c2)CC1
: