Target
Epidermal growth factor receptor [1-745,751-1210]
Ligand
BDBM504416
Substrate
Meas. Tech.
Kinase Assay
IC50
0.290±n/a nM
Citation
 Liu, XDing, CZChen, SWu, LHu, LWan, H Quinazoline compound for EGFR inhibition US Patent  US11040984 Publication Date 6/22/2021 
Target
Name:
Epidermal growth factor receptor [1-745,751-1210]
Synonyms:
EGFR EGFR (del 746-750) ERBB Epidermal growth factor receptor (EGFR)(d746-750) | HER1
Type:
Enzyme Catalytic Domain
Mol. Mass.:
133681.95
Organism:
Homo sapiens (Human)
Description:
P00533[1-745,751-1210]
Residue:
1205
  
Inhibitor
Name:
BDBM504416
Synonyms:
US11040984, Compound 33
Type:
Small organic molecule
Emp. Form.:
C22H21ClFN5O2
Mol. Mass.:
441.886
SMILES:
CC(C)N1CC2(C1)CN(C(=O)O2)c1ccc2ncnc(Nc3cccc(Cl)c3F)c2c1
: