BDBM149916 US8975415, RP197::US9242973, 197
SMILES CC1(C)Oc2ccc(NC(=O)c3ccc(cn3)C#N)cc2C2(COC(N)=N2)C11COC1
InChI Key InChIKey=GPWZMCGYHYETLO-UHFFFAOYSA-N
Data  2 KI  5 IC50
  Tab Delimited (TSV)   2D SDfile   Computed 3D by Vconf -m prep SDfile
Find this compound or compounds like it in BindingDB:
Activity Spreadsheet -- Enzyme Inhibition Constant Data from BindingDB
Found 5 hits for monomerid = 149916
TargetBeta-secretase 1(Homo sapiens (Human))
Comentis
US Patent
LigandPNGBDBM149916(US8975415, RP197 | US9242973, 197)
Affinity DataKi:  72nM IC50:  118nM. Assay description: Potency of test compounds were determined by measurement of their inhibition of BACE1 activity toward a fluorescent substrate. Experiments were perfo...
In DepthDetails US Patent
TargetBeta-secretase 1(Homo sapiens (Human))
Comentis
US Patent
LigandPNGBDBM149916(US8975415, RP197 | US9242973, 197)
Affinity DataKi:  72nM ΔG°:  -9.74kcal/mole IC50:  118nMpH: 4.4 T: 2°C. Assay description: Test Example 1: Potency of test compounds were determined by measurement of their inhibition of BACE1 activity toward a fluorescent substrate. Experi...
In DepthDetails US Patent
TargetPotassium voltage-gated channel subfamily H member 2(Homo sapiens (Human))
Comentis
US Patent
LigandPNGBDBM149916(US8975415, RP197 | US9242973, 197)
Affinity DataIC50: >1.00E+4nM. Assay description: Test Example 5: The hERG potassium current was measured in a hERG-stably-expressing Chinese hamster ovary K1 (CHO) cells. The experiments were perfor...
In DepthDetails US Patent
TargetBeta-secretase 1(Homo sapiens (Human))
Comentis
US Patent
LigandPNGBDBM149916(US8975415, RP197 | US9242973, 197)
Affinity DataIC50:  5.70nMT: 2°C. Assay description: Test Example 3: The potency of compounds against BACE1 activity was determined in a cellular assay of Aβ production. Human SK-N-BE(2) neuroblas...
In DepthDetails US Patent
TargetPotassium voltage-gated channel subfamily H member 2(Homo sapiens (Human))
Comentis
US Patent
LigandPNGBDBM149916(US8975415, RP197 | US9242973, 197)
Affinity DataIC50: >1.00E+4nMT: 2°C. Assay description: The hERG potassium current was measured in a hERG-stably-expressing Chinese hamster ovary K1 (CHO) cells. The experiments were performed using an aut...
In DepthDetails US Patent