BDBM22121 aza-peptide Michael acceptor, 5e::benzyl N-[(1S)-1-{[(2S)-1-[(2E)-N-benzyl-3-[N-(carbamoylmethyl)hydrazido]prop-2-enamide]-1-oxopropan-2-yl]carbamoyl}ethyl]carbamate
SMILES C[C@H](NC(=O)OCc1ccccc1)C(=O)N[C@@H](C)C(=O)NN(CC(N)=O)C(=O)C=CC(=O)NCc1ccccc1
InChI Key InChIKey=LDJITAXPMOFJLU-OALUTQOASA-N
Data  3 IC50
  Tab Delimited (TSV)   2D SDfile   Computed 3D by Vconf -m prep SDfile
Find this compound or compounds like it in BindingDB:
Activity Spreadsheet -- Enzyme Inhibition Constant Data from BindingDB
Found 3 hits for monomerid = 22121
TargetLegumain(Schistosoma mansoni)
Georgia Institute Of Technology
LigandPNGBDBM22121(aza-peptide Michael acceptor, 5e | benzyl N-[(1S)-...)
Affinity DataIC50:  1.00E+3nMpH: 6.8 T: 2°C. Assay description: AE activity in the induction medium was measured with the substrate Cbz-Ala-Ala-Asn-AMC. In a black 96-well microtiter plate, aza-peptidyl inhibitors...
In DepthDetails ArticlePubMed
TargetLegumain(Ixodes ricinus)
Georgia Institute Of Technology
LigandPNGBDBM22121(aza-peptide Michael acceptor, 5e | benzyl N-[(1S)-...)
Affinity DataIC50:  200nMT: 2°C. Assay description: AE activity in the induction medium was measured with the substrate Cbz-Ala-Ala-Asn-AMC. In a black 96-well microtiter plate, aza-peptidyl inhibitors...
In DepthDetails ArticlePubMed
TargetClan CD, family C13, asparaginyl endopeptidase-like cysteine peptidase(Trichomonas vaginalis G3)
Georgia Institute Of Technology
LigandPNGBDBM22121(aza-peptide Michael acceptor, 5e | benzyl N-[(1S)-...)
Affinity DataIC50:  10nMpH: 6.8 T: 2°C. Assay description: AE activity in the induction medium was measured with the substrate Cbz-Ala-Ala-Asn-AMC. In a black 96-well microtiter plate, aza-peptidyl inhibitors...
In DepthDetails ArticlePubMed