BDBM50085699 (S,S / R,R)4-Carboxy-5-[(2,4-dicarboxy-butyl)-hydroxy-phosphinoyl]-pentanoic acid::(meso)4-Carboxy-5-[(2,4-dicarboxy-butyl)-hydroxy-phosphinoyl]-pentanoic acid::2-[(2,4-Dicarboxy-butyl)-hydroxy-phosphinoylmethyl]-pentanedioic acid::4-Carboxy-5-[(2,4-dicarboxy-butyl)-hydroxy-phosphinoyl]-pentanoic acid::CHEMBL134749
SMILES OC(=O)CCC(CP(O)(=O)CC(CCC(O)=O)C(O)=O)C(O)=O
InChI Key InChIKey=SGRJLTOOQLQDRH-UHFFFAOYSA-N
Data  1 IC50  3 EC50
  Tab Delimited (TSV)   2D SDfile   Computed 3D by Vconf -m prep SDfile
Find this compound or compounds like it in BindingDB:
Activity Spreadsheet -- Enzyme Inhibition Constant Data from BindingDB
Found 4 hits for monomerid = 50085699
TargetMetabotropic glutamate receptor 3(Homo sapiens (Human))
Georgetown University Medical Center
Curated by ChEMBL
LigandPNGBDBM50085699((S,S / R,R)4-Carboxy-5-[(2,4-dicarboxy-butyl)-hydr...)
Affinity DataEC50:  4.50E+4nM. Assay description: Agonist potency of the compound against cloned Metabotropic glutamate receptor 3
In DepthDetails ArticlePubMed
TargetGlutamate carboxypeptidase 2(Rattus norvegicus)
Guilford Pharmaceuticals
Curated by ChEMBL
LigandPNGBDBM50085699((S,S / R,R)4-Carboxy-5-[(2,4-dicarboxy-butyl)-hydr...)
Affinity DataIC50:  0.5nM. Assay description: Inhibitory concentration against rat brain NAALADase (Folate hydrolase)
In DepthDetails ArticlePubMed
TargetMetabotropic glutamate receptor 3(Homo sapiens (Human))
Georgetown University Medical Center
Curated by ChEMBL
LigandPNGBDBM50085699((S,S / R,R)4-Carboxy-5-[(2,4-dicarboxy-butyl)-hydr...)
Affinity DataEC50:  3.90E+4nM. Assay description: Agonist potency of the compound against cloned Metabotropic glutamate receptor 3
In DepthDetails ArticlePubMed
TargetMetabotropic glutamate receptor 3(Homo sapiens (Human))
Georgetown University Medical Center
Curated by ChEMBL
LigandPNGBDBM50085699((S,S / R,R)4-Carboxy-5-[(2,4-dicarboxy-butyl)-hydr...)
Affinity DataEC50:  3.90E+4nM. Assay description: Agonist potency of the compound against cloned Metabotropic glutamate receptor 3
In DepthDetails ArticlePubMed