BDBM50154699 2''-[6-(4-Nitro-benzylsulfanyl)-purin-9-ylmethyl]-biphenyl-3-ol::CHEMBL371196
SMILES Oc1cccc(c1)-c1ccccc1Cn1cnc2c(SCc3ccc(cc3)[N+]([O-])=O)ncnc12
InChI Key InChIKey=XXWWKZDSXDKSBU-UHFFFAOYSA-N
Data  1 KI
  Tab Delimited (TSV)   2D SDfile   Computed 3D by Vconf -m prep SDfile
Find this compound or compounds like it in BindingDB:
Activity Spreadsheet -- Enzyme Inhibition Constant Data from BindingDB
Found 1 hit for monomerid = 50154699
TargetEquilibrative nucleoside transporter 1(Homo sapiens (Human))
Leiden University
Curated by ChEMBL
LigandPNGBDBM50154699(2''-[6-(4-Nitro-benzylsulfanyl)-purin-9-ylmethyl]-...)
Affinity DataKi:  196nM. Assay description: Inhibition of [3H]-NBTI binding to nucleoside transport protein of human erythrocyte membrane
In DepthDetails ArticlePubMed