BDBM50212662 2-(4-phenoxyphenyl)-4-phenylbut-3-yn-1-amine hydrochloride::CHEMBL229686
SMILES [NH3+]CC(C#Cc1ccccc1)c1ccc(Oc2ccccc2)cc1
InChI Key InChIKey=XFJQMNJAVJEERH-UHFFFAOYSA-O
Data  2 EC50
  Tab Delimited (TSV)   2D SDfile   Computed 3D by Vconf -m prep SDfile
Find this compound or compounds like it in BindingDB:
Activity Spreadsheet -- Enzyme Inhibition Constant Data from BindingDB
Found 2 hits for monomerid = 50212662
TargetTrace amine-associated receptor 1(Mus musculus (Mouse))
University Of California San Francisco
Curated by ChEMBL
LigandPNGBDBM50212662(2-(4-phenoxyphenyl)-4-phenylbut-3-yn-1-amine hydro...)
Affinity DataEC50: >1.00E+3nM. Assay description: Activity at mouse TAAR1 expressed in HEK293 cells assessed as cAMP production
In DepthDetails ArticlePubMed
TargetTrace amine-associated receptor 1(Rattus norvegicus (Rat))
University Of California San Francisco
Curated by ChEMBL
LigandPNGBDBM50212662(2-(4-phenoxyphenyl)-4-phenylbut-3-yn-1-amine hydro...)
Affinity DataEC50:  41nM. Assay description: Activity at rat TAAR1 expressed in HEK293 cells assessed as cAMP production
In DepthDetails ArticlePubMed