BDBM50246609 (4R)-4-Ethoxy-1-(2-methyl-4-(2,3,4,5-tetrahydro-1-benzazepin-1-ylcarbonyl)benzyl-carbamoyl)-L-proline-N,N-dimethylamide::CHEMBL472697
SMILES CCO[C@@H]1C[C@H](N(C1)C(=O)NCc1ccc(cc1C)C(=O)N1CCCCc2ccccc12)C(=O)N(C)C
InChI Key InChIKey=LTIVQBYZZUZZGE-RSXGOPAZSA-N
Data  2 EC50
  Tab Delimited (TSV)   2D SDfile   Computed 3D by Vconf -m prep SDfile
Find this compound or compounds like it in BindingDB:
Activity Spreadsheet -- Enzyme Inhibition Constant Data from BindingDB
Found 2 hits for monomerid = 50246609
TargetVasopressin V2 receptor(Rattus norvegicus (Rat))
Vantia
Curated by ChEMBL
LigandPNGBDBM50246609((4R)-4-Ethoxy-1-(2-methyl-4-(2,3,4,5-tetrahydro-1-...)
Affinity DataEC50:  15nM. Assay description: Agonist activity at rat vasopressin V2 receptor expressed in HEK293 cells assessed as increase in intracellular cAMP level by CRE-luciferase reporter...
In DepthDetails ArticlePubMed
TargetVasopressin V2 receptor(Homo sapiens (Human))
Vantia
Curated by ChEMBL
LigandPNGBDBM50246609((4R)-4-Ethoxy-1-(2-methyl-4-(2,3,4,5-tetrahydro-1-...)
Affinity DataEC50:  4.30nM. Assay description: Agonist activity at human vasopressin V2 receptor expressed in HEK293 cells assessed as increase in intracellular cAMP level by CRE-luciferase report...
In DepthDetails ArticlePubMed