BDBM50266501 CHEMBL455853::Methyl 7-(2-(2-(biphenyl-4-yl)-5-methyloxazol-4-yl)ethoxy)-2-oxochroman-3-carboxylate
SMILES COC(=O)C1Cc2ccc(OCCc3nc(oc3C)-c3ccc(cc3)-c3ccccc3)cc2OC1=O
InChI Key InChIKey=ZTWQZGIOXRCDQP-UHFFFAOYSA-N
Data  2 EC50
  Tab Delimited (TSV)   2D SDfile   Computed 3D by Vconf -m prep SDfile
Find this compound or compounds like it in BindingDB:
Activity Spreadsheet -- Enzyme Inhibition Constant Data from BindingDB
Found 2 hits for monomerid = 50266501
TargetPeroxisome proliferator-activated receptor gamma(Homo sapiens (Human))
Graduate School Of The Chinese Academy Of Sciences
Curated by ChEMBL
LigandPNGBDBM50266501(CHEMBL455853 | Methyl 7-(2-(2-(biphenyl-4-yl)-5-me...)
Affinity DataEC50:  1.12E+3nM. Assay description: Agonist activity at human PPARgamma in U2OS cells by transactivation assay
In DepthDetails ArticlePubMed
TargetPeroxisome proliferator-activated receptor alpha(Homo sapiens (Human))
Graduate School Of The Chinese Academy Of Sciences
Curated by ChEMBL
LigandPNGBDBM50266501(CHEMBL455853 | Methyl 7-(2-(2-(biphenyl-4-yl)-5-me...)
Affinity DataEC50:  910nM. Assay description: Agonist activity at human PPARalpha in U2OS cells by transactivation assay
In DepthDetails ArticlePubMed