BDBM80613 1-(2,3,4-Trimethoxy-benzyl)-piperazine::1-(2,3,4-trimethoxybenzyl)piperazine;hydrochloride::1-[(2,3,4-trimethoxyphenyl)methyl]piperazine;hydrochloride::MLS001240268::SMR000674573::TRIMETAZIDINE::cid_9926449
SMILES COc1ccc(CN2CCNCC2)c(OC)c1OC
InChI Key InChIKey=UHWVSEOVJBQKBE-UHFFFAOYSA-N
Data  7 IC50
  Tab Delimited (TSV)   2D SDfile   Computed 3D by Vconf -m prep SDfile
Find this compound or compounds like it in BindingDB:
Activity Spreadsheet -- Enzyme Inhibition Constant Data from BindingDB
Found 7 hits for monomerid = 80613
TargetDNA dC->dU-editing enzyme APOBEC-3A(Homo sapiens (Human))
Burnham Center For Chemical Genomics
Curated by PubChem BioAssay
LigandPNGBDBM80613(1-(2,3,4-Trimethoxy-benzyl)-piperazine | 1-(2,3,4-...)
Affinity DataIC50:  8.26E+3nMT: 2°C. Assay description: Data Source: Sanford-Burnham Center for Chemical Genomics (SBCCG) Source Affiliation: Sanford-Burnham Medical Research Institute (SBMRI, San Diego, C...
In DepthDetails PCBioAssay
TargetDNA dC->dU-editing enzyme APOBEC-3G(Homo sapiens (Human))
Burnham Center For Chemical Genomics
Curated by PubChem BioAssay
LigandPNGBDBM80613(1-(2,3,4-Trimethoxy-benzyl)-piperazine | 1-(2,3,4-...)
Affinity DataIC50:  7.19E+3nMT: 2°C. Assay description: Data Source: Sanford-Burnham Center for Chemical Genomics (SBCCG) Source Affiliation: Sanford-Burnham Medical Research Institute (SBMRI, San Diego, C...
In DepthDetails PCBioAssay
TargetCarboxy-terminal domain RNA polymerase II polypeptide A small phosphatase 1(Homo sapiens (Human))
Burnham Center For Chemical Genomics
Curated by PubChem BioAssay
LigandPNGBDBM80613(1-(2,3,4-Trimethoxy-benzyl)-piperazine | 1-(2,3,4-...)
Affinity DataIC50:  8.85E+3nM. Assay description: Data Source: Sanford-Burnham Center for Chemical Genomics (SBCCG) Source Affiliation: Sanford-Burnham Medical Research Institute (SBMRI, San Diego, C...
In DepthDetails PCBioAssay
TargetCarnitine O-palmitoyltransferase 1, muscle isoform(Rattus norvegicus)
F. Hoffmann-La Roche
Curated by ChEMBL
LigandPNGBDBM80613(1-(2,3,4-Trimethoxy-benzyl)-piperazine | 1-(2,3,4-...)
Affinity DataIC50:  1.30E+3nM. Assay description: Inhibition of CPT1A in rat myocardium
In DepthDetails ArticlePubMed
TargetCarnitine O-palmitoyltransferase 1, muscle isoform(Homo sapiens (Human))
F. Hoffmann-La Roche
Curated by ChEMBL
LigandPNGBDBM80613(1-(2,3,4-Trimethoxy-benzyl)-piperazine | 1-(2,3,4-...)
Affinity DataIC50: >1.00E+5nM. Assay description: Inhibition of human CPT1B
In DepthDetails ArticlePubMed
TargetCarnitine O-palmitoyltransferase 1, liver isoform(Homo sapiens (Human))
F. Hoffmann-La Roche
Curated by ChEMBL
LigandPNGBDBM80613(1-(2,3,4-Trimethoxy-benzyl)-piperazine | 1-(2,3,4-...)
Affinity DataIC50: >1.00E+5nM. Assay description: Inhibition of human CPT1A
In DepthDetails ArticlePubMed
TargetCarnitine O-palmitoyltransferase 2, mitochondrial(Homo sapiens (Human))
F. Hoffmann-La Roche
Curated by ChEMBL
LigandPNGBDBM80613(1-(2,3,4-Trimethoxy-benzyl)-piperazine | 1-(2,3,4-...)
Affinity DataIC50: >1.00E+5nM. Assay description: Inhibition of human CPT2
In DepthDetails ArticlePubMed