BDBM50444649 CHEMBL3098608
SMILES FC(F)(F)c1cccc(c1)S(=O)(=O)c1ccc(CNC(NC#N)=Nc2ccncc2)cc1
InChI Key InChIKey=UWQVVCUFZYQWCW-UHFFFAOYSA-N
Data  1 IC50
  Tab Delimited (TSV)   2D SDfile   Computed 3D by Vconf -m prep SDfile
Find this compound or compounds like it in BindingDB:
Activity Spreadsheet -- Enzyme Inhibition Constant Data from BindingDB
Found 1 hit for monomerid = 50444649
TargetNicotinamide phosphoribosyltransferase(Homo sapiens (Human))
Forma Therapeutics
Curated by ChEMBL
LigandPNGBDBM50444649(CHEMBL3098608)
Affinity DataIC50:  2.40nM. Assay description: Inhibition of Nampt (unknown origin) using nicotinamide as substrate preincubated for 15 mins measured after 30 mins by mass spectrometry analysis
In DepthDetails ArticlePubMed