BDBM79334 MLS002391556::N-[3-(dimethylamino)propyl]-4-(8-hydroxy-6-quinolinyl)benzamide;2,2,2-trifluoroacetic acid::N-[3-(dimethylamino)propyl]-4-(8-hydroxy-6-quinolyl)benzamide;2,2,2-trifluoroacetic acid::N-[3-(dimethylamino)propyl]-4-(8-hydroxyquinolin-6-yl)benzamide;2,2,2-trifluoroacetic acid::N-[3-(dimethylamino)propyl]-4-(8-oxidanylquinolin-6-yl)benzamide;2,2,2-tris(fluoranyl)ethanoic acid::SMR001355524::cid_44143208
SMILES CN(C)CCCNC(=O)c1ccc(cc1)-c1cc(O)c2ncccc2c1
InChI Key InChIKey=QDBVSOZTVKXUES-UHFFFAOYSA-N
Data  4 IC50
  Tab Delimited (TSV)   2D SDfile   Computed 3D by Vconf -m prep SDfile
Find this compound or compounds like it in BindingDB:
Activity Spreadsheet -- Enzyme Inhibition Constant Data from BindingDB
Found 4 hits for monomerid = 79334
TargetUbiquitin-conjugating enzyme E2 N(Homo sapiens (Human))
Burnham Center For Chemical Genomics
Curated by PubChem BioAssay
LigandPNGBDBM79334(MLS002391556 | N-[3-(dimethylamino)propyl]-4-(8-hy...)
Affinity DataIC50:  3.15E+3nM. Assay description: Data Source: Sanford-Burnham Center for Chemical Genomics (SBCCG) Source Affiliation: Sanford-Burnham Medical Research Institute (SBMRI, San Diego CA...
In DepthDetails PCBioAssay
TargetLysine-specific demethylase 4E(Homo sapiens (Human))
St. Jude Children'S Research Hospital
Curated by ChEMBL
LigandPNGBDBM79334(MLS002391556 | N-[3-(dimethylamino)propyl]-4-(8-hy...)
Affinity DataIC50:  920nM. Assay description: Inhibition of KDM4E (unknown origin) measured by Alphascreen assay
In DepthDetails PubMed
TargetUbiquitin-conjugating enzyme E2 N(Homo sapiens (Human))
Burnham Center For Chemical Genomics
Curated by PubChem BioAssay
LigandPNGBDBM79334(MLS002391556 | N-[3-(dimethylamino)propyl]-4-(8-hy...)
Affinity DataIC50:  3.89E+3nM. Assay description: Data Source: Sanford-Burnham Center for Chemical Genomics (SBCCG) Source Affiliation: Sanford-Burnham Medical Research Institute (SBMRI, San Diego CA...
In DepthDetails PCBioAssay
TargetBcl-2-related protein A1(Mus musculus (Mouse))
Burnham Center For Chemical Genomics
Curated by PubChem BioAssay
LigandPNGBDBM79334(MLS002391556 | N-[3-(dimethylamino)propyl]-4-(8-hy...)
Affinity DataIC50:  7.49E+3nM. Assay description: Data Source: Sanford-Burnham Center for Chemical Genomics (SBCCG) Source Affiliation: Sanford-Burnham Medical Research Institute (SBMRI, San Diego CA...
In DepthDetails PCBioAssay